{"text_format":"1","workbook":"xlsx","n_sheets":7,"sheets":["(はじめにお読み下さい)実績報告書の使い方","実績報告書","実績額一覧","個票1","職員表","役員等調書","計算用"],"not_rendered":{"charts":0,"images":1,"macros":1,"external_links":0,"defined_names":8,"comments":5,"pivot_tables":0},"unopened":[],"bounds":{"document_bytes":16777216,"sheet_cells":100000,"rows_first":2000,"rows_last":500,"rows_between":2000,"halvings":0,"cell_chars":16384,"cell_head_chars":4096},"cells_cut":0,"cells_raw":0,"read":"whole","date_system":"1900"}

{"sheet":"(はじめにお読み下さい)実績報告書の使い方","index":0,"n_rows":18,"n_cols":3,"rows_kept":18,"cut":false,"hidden":false,"merged":[[2,1,2,2],[5,1,5,2],[6,1,6,2],[4,1,4,2],[0,1,0,2]]}
[null,"　　　　　　　　　　　　　　　　　　実績報告書について"]
[]
[null,"【提出先】三重県医療保健部長寿介護課へ郵送（メール・FAX不可）\n　　　　　　宛先：〒514-8570　津市広明町１３番地　三重県 医療保健部 長寿介護課\n\n　　※交付申請書の提出先が国保連合会・県のいずれの場合も、実績報告書は三重県医療保健部\n　　　長寿介護課へ郵送してください。（国保連合会には提出しないでください。）"]
[]
[null,"【作成単位】\n１件の交付決定に対して１件の実績報告書を作成していただくことになります。複数の交付決定を受けている法人は、それぞれの交付決定ごとに、実績報告書を作成してください。\n\n【実績報告額】\n事業所ごとに、実績報告額が交付決定額を下回る場合は、差額分を返金していただきます。なお、事業所ごとの実績額が交付決定額を上回る場合でも、交付決定額以上の金額を交付することはできません。\n"]
[null,"【実績報告の作成手順】"]
[null,"・黄色のセルのみに入力してください！\n　（白色セルには計算式が入っているので、入力しないでください！）\n・シートの作成手順：様式３（職員票）→様式２（個票）→様式１（実績額一覧）→実績報告書（様式第10号）　　　"]
[]
["手順","都道府県の作業","事業所（法人本部）の作業"]
[1,"本Excelを管内の介護サービス事業者に配布"]
[2,null,"【様式３（職員表）】\n・支払実績を入力（交付申請書提出後に変更が生じた場合は修正）\n・慰労金の支払年月日、支払金額、支払わなかった場合の理由を記入\n※変更がなければ、交付申請書ファイルの様式３（職員表）のデータをコピーしていただいても結構です。\n※Excelファイルを開封した際は、｢コンテンツの有効化｣をクリック\n"]
[{"$f":"A11+1","v":3},null,"各事業所の様式３（職員表）を法人単位で一覧表として取りまとめ\n兼務する複数の介護サービス事業所等から重複して申請している者がいないかを確認\n※記入欄が不足する場合は、6行目～85行目を行ごとコピーし、86行目に右クリック→「コピーしたセルの挿入」で挿入。\n"]
[4,null,"【様式２（個票）】\n黄色のセルに入力\n各事業所の個票のシートを１つのExcelファイルに集約し、個票シート名を「個票●」（●は１からの半角の通し番号）に修正\n※個票シート名は、交付申請時のそれぞれの事業所の番号と同じにしてください。（各事業所の順番を交付申請時と同じにする。）\n"]
[5,null,"様式２（個票）の内容が、様式１（実績額一覧）に正しく反映されていることを確認\n※記入欄が不足する場合は、6行目～20行目を行ごとコピーし、21行目に右クリック→「コピーしたセルの挿入」で挿入。\n\n"]
[6,null,"実績報告書に、提出年月日、法人名、代表者名、交付決定日、文書番号、連絡先を入力\n"]
[{"$f":"A15+1","v":7},null,"完成したExcelファイルを紙に出力し、印刷が正しく表示されているか確認のうえ、封筒に「実績報告書（介護分）在中」と明記し、郵送\n※他の書類（介護給付費等に関する費用等の請求等）を同封しないこと。\n"]
[8,"事業者から実績報告書を受領し、内容を審査し、額の確定通知を発出\n返還金がある場合は、納入通知書を発行\n"]
[9,null,"実績報告額が交付決定額を下回る事業所がある場合、県から送付される納入通知書により、実績報告額と交付決定額の差額を返還\n"]

{"sheet":"実績報告書","index":1,"n_rows":45,"n_cols":43,"rows_kept":45,"cut":false,"hidden":false,"merged":[[27,2,28,16],[27,17,28,20],[27,21,28,23],[27,24,28,27],[25,3,25,16],[25,17,26,20],[25,21,26,23],[25,24,26,27],[44,17,44,24],[40,25,40,35],[39,30,39,35],[41,25,41,35],[42,25,42,35],[43,25,43,35],[44,25,44,35],[39,26,39,29],[12,0,12,38],[13,0,13,38],[11,5,11,6],[11,8,11,9],[11,18,11,20],[23,35,24,37],[21,28,22,30],[19,28,20,30],[21,35,22,37],[18,24,18,30],[18,31,18,37],[1,40,1,57],[25,31,26,34],[25,35,26,37],[27,28,28,30],[27,31,28,34],[27,35,28,37],[23,28,24,30],[23,31,24,34],[19,31,20,34],[19,35,20,37],[21,31,22,34],[14,0,14,38],[15,1,15,9],[15,10,15,17],[18,2,18,16],[18,17,18,23],[25,28,26,30],[26,3,26,16],[24,3,24,16],[21,3,21,16],[21,17,22,20],[21,21,22,23],[21,24,22,27],[22,3,22,16],[23,3,23,16],[23,17,24,20],[23,21,24,23],[23,24,24,27],[19,2,20,2],[19,3,20,16],[19,17,20,20],[19,21,20,23],[19,24,20,27],[0,0,0,5],[9,0,9,38],[2,35,2,36],[2,32,2,33],[2,29,2,30],[2,27,2,28],[4,0,4,5],[4,7,4,11],[6,20,6,37],[7,20,7,37]]}
["（様式第10号）"]
[null,null,null,null,null,null,null,null,null,null,null,null,null,null,null,null,null,null,null,null,null,null,null,null,null,null,null,null,null,null,null,null,null,null,null,null,null,null,null,null,{"$f":"IF($K$16=SUM(実績額一覧!$L$5:$L$29),\"○\",\"!実績額一覧の合計額と一致しません\")","v":"○"}]
[null,null,null,null,null,null,null,null,null,null,null,null,null,null,null,null,null,null,null,null,null,null,null,null,null,null,null,"令和",null,null,null,"年",null,null,"月",null,null,"日"]
[]
["三重県知事",null,null,null,null,null,"様"]
[]
[null,null,null,null,null,null,null,null,null,null,null,null,null,null,null,null,null,null,null,null,"（法人名）",null,null,null,null,null,null,null,null,null,null,null,null,null,null,null,null,null,null,null,null,"※","送付済の交付決定通知の様式"]
[null,null,null,null,null,null,null,null,null,null,null,null,null,null,null,null,null,null,null,null,"（役職・代表者名）"]
[]
["令和２年度新型コロナウイルス感染症緊急包括支援交付金（介護分）に係る実績報告書"]
[]
[null,"令","和　",null,"年",null,null,"月",null,null,"日付け",null,null,"医保第１３－",null,null,null,null,null,null,null,"号","で交付決定を受けた令和２年度新型コロナ"]
["ウイルス感染症緊急包括支援交付金（介護分）について、事業が完了したので、交付要領第10条の"]
["規定により、関係書類を添え、下記のとおり報告します。"]
["記"]
[null,"実績報告額：　",null,null,null,null,null,null,null,null,{"$f":"R28","v":0},null,null,null,null,null,null,null,"千円"]
[]
[null,"（内訳）"]
[null,null,"事業名",null,null,null,null,null,null,null,null,null,null,null,null,null,null,"実績報告額",null,null,null,null,null,null,"交付決定額\n(交付済額）",null,null,null,null,null,null,"返還額"]
[null,null,"1.","介護慰労金事業",null,null,null,null,null,null,null,null,null,null,null,null,null,{"$f":"SUM(実績額一覧!G5:G29)","v":0},null,null,null,"千円",null,null,{"$f":"SUM(実績額一覧!M5:M29)","v":0},null,null,null,"千円",null,null,{"$f":"IF(SUM(実績額一覧!R5:R29)=0,\"0\",SUM(実績額一覧!R5:R29))","v":"0"},null,null,null,"千円"]
{"$rows_left_out":26}
{"sheet":"実績額一覧","index":2,"n_rows":33,"n_cols":24,"rows_kept":33,"cut":false,"hidden":false,"merged":[[4,23,4,42],[2,12,2,16],[2,17,2,21],[2,6,2,11],[2,0,3,0],[2,1,3,1],[2,2,3,2],[2,3,3,3],[2,5,3,5],[2,4,3,4]]}
["（様式１）事業所・施設別実績額一覧"]
[]
["No.","介護保険\n事業所番号","事業所・施設名","サービス種別","郵便番号","住所","実績報告額（千円）",null,null,null,null,null,"交付済額（交付決定額）（千円）",null,null,null,null,"返還額（千円）"]
[null,null,null,null,null,null,"介護\n慰労金","20万円\n対象者の\n有無","感染対策\n費用助成\n事業","個別再開\n支援助成\n事業","再開環境\n整備助成\n事業","合計","介護\n慰労金","感染対策\n費用助成\n事業","個別再開\n支援助成\n事業","再開環境\n整備助成\n事業","合計","介護\n慰労金","感染対策\n費用助成\n事業","個別再開\n支援助成\n事業","再開環境\n整備助成\n事業","合計"]
[{"$f":"ROW()-4","v":1},{"$f":"IFERROR(INDIRECT(\"個票\"&$A5&\"！$h$7\"),\"\")","v":0},{"$f":"IFERROR(INDIRECT(\"個票\"&$A5&\"！$t$7\"),\"\")","v":0},{"$f":"IFERROR(INDIRECT(\"個票\"&$A5&\"！$h$10\"),\"\")","v":0},{"$f":"IFERROR(INDIRECT(\"個票\"&$A5&\"！$d$9\"),\"\")","v":0},{"$f":"IFERROR(INDIRECT(\"個票\"&$A5&\"！$H$9\")&INDIRECT(\"個票\"&$A5&\"！$L$9\"),\"\")","v":"三重県"},{"$f":"IFERROR(INDIRECT(\"個票\"&$A5&\"！$Q$20\"),\"\")","v":"0"},{"$f":"IFERROR(INDIRECT(\"個票\"&$A5&\"！$ao$22\"),\"\")","v":0},{"$f":"IFERROR(INDIRECT(\"個票\"&$A5&\"！$ai$24\"),\"\")","v":"0"},{"$f":"IFERROR(INDIRECT(\"個票\"&$A5&\"！$Q$39\"),\"\")","v":"0"},{"$f":"IFERROR(INDIRECT(\"個票\"&$A5&\"！$ai$48\"),\"\")","v":"0"},{"$f":"SUM(G5,I5,J5,K5)","v":0},{"$f":"IFERROR(INDIRECT(\"個票\"&$A5&\"！$ｚ$20\"),\"\")","v":0},{"$f":"IFERROR(INDIRECT(\"個票\"&$A5&\"！$ai$25\"),\"\")","v":0},{"$f":"IFERROR(INDIRECT(\"個票\"&$A5&\"！$ｚ$39\"),\"\")","v":0},{"$f":"IFERROR(INDIRECT(\"個票\"&$A5&\"！$ai$49\"),\"\")","v":0},{"$f":"SUM(M5,N5,O5,P5)","v":0},{"$f":"IFERROR(INDIRECT(\"個票\"&$A5&\"！$ai$20\"),\"\")","v":"0"},{"$f":"IFERROR(INDIRECT(\"個票\"&$A5&\"！$ai$26\"),\"\")","v":"0"},{"$f":"IFERROR(INDIRECT(\"個票\"&$A5&\"！$ai$39\"),\"\")","v":"0"},{"$f":"IFERROR(INDIRECT(\"個票\"&$A5&\"！$ai$50\"),\"\")","v":"0"},{"$f":"SUM(R5,S5,T5,U5)","v":0},null,{"$f":"IF(_xlfn.SHEETS()-5=COUNTIF(L5:L33,\">0\"),\"○\",\"！（本表の事業所数と個票の枚数が一致しません）\")","v":"！（本表の事業所数と個票の枚数が一致しません）"}]
[{"$f":"ROW()-4","v":2},{"$f":"IFERROR(INDIRECT(\"個票\"&$A6&\"！$h$7\"),\"\")","v":""},"","","","",{"$f":"IFERROR(INDIRECT(\"個票\"&$A6&\"！$Q$20\"),\"\")","v":""},"","",{"$f":"IFERROR(INDIRECT(\"個票\"&$A6&\"！$Q$39\"),\"\")","v":""},{"$f":"IFERROR(INDIRECT(\"個票\"&$A6&\"！$ai$48\"),\"\")","v":""},{"$f":"SUM(G6,I6,J6,K6)","v":0},{"$f":"IFERROR(INDIRECT(\"個票\"&$A6&\"！$ｚ$20\"),\"\")","v":""},{"$f":"IFERROR(INDIRECT(\"個票\"&$A6&\"！$ai$25\"),\"\")","v":""},{"$f":"IFERROR(INDIRECT(\"個票\"&$A6&\"！$ｚ$39\"),\"\")","v":""},{"$f":"IFERROR(INDIRECT(\"個票\"&$A6&\"！$ai$49\"),\"\")","v":""},{"$f":"SUM(M6,N6,O6,P6)","v":0},{"$f":"IFERROR(INDIRECT(\"個票\"&$A6&\"！$ai$20\"),\"\")","v":""},{"$f":"IFERROR(INDIRECT(\"個票\"&$A6&\"！$ai$26\"),\"\")","v":""},{"$f":"IFERROR(INDIRECT(\"個票\"&$A6&\"！$ai$39\"),\"\")","v":""},{"$f":"IFERROR(INDIRECT(\"個票\"&$A6&\"！$ai$50\"),\"\")","v":""},{"$f":"SUM(R6,S6,T6,U6)","v":0}]
[3,"","","","","","","","","","",0,"","","","",0,"","","","",0]
[4,"","","","","","","","","","",0,"","","","",0,"","","","",0]
[5,"","","","","","","","","","",0,"","","","",0,"","","","",0]
[6,"","","","","","","","","","",0,"","","","",0,"","","","",0]
[7,"","","","","","","","","","",0,"","","","",0,"","","","",0]
[8,"","","","","","","","","","",0,"","","","",0,"","","","",0]
[9,"","","","","","","","","","",0,"","","","",0,"","","","",0]
[10,"","","","","","","","","","",0,"","","","",0,"","","","",0]
[11,"","","","","","","","","","",0,"","","","",0,"","","","",0]
[12,"","","","","","","","","","",0,"","","","",0,"","","","",0]
[13,"","","","","","","","","","",0,"","","","",0,"","","","",0]
[14,"","","","","","","","","","",0,"","","","",0,"","","","",0]
[15,"","","","","","","","","","",0,"","","","",0,"","","","",0]
[16,"","","","","","","","","","",0,"","","","",0,"","","","",0]
{"$rows_left_out":14}
{"sheet":"個票1","index":3,"n_rows":62,"n_cols":84,"rows_kept":62,"cut":false,"hidden":false,"merged":[[59,7,59,11],[59,12,59,38],[60,0,60,6],[60,7,60,11],[60,12,60,38],[61,0,61,38],[56,7,56,11],[56,12,56,38],[57,7,57,11],[57,12,57,38],[58,7,58,11],[58,12,58,38],[53,7,53,11],[53,12,53,38],[54,7,54,11],[54,12,54,38],[55,7,55,11],[55,12,55,38],[50,0,50,6],[50,7,50,11],[50,12,50,38],[51,7,51,11],[51,12,51,38],[52,7,52,11],[52,12,52,38],[48,29,48,33],[48,34,48,36],[48,37,48,38],[49,29,49,33],[49,34,49,36],[49,37,49,38],[45,0,45,33],[45,34,45,36],[45,37,45,38],[47,23,47,27],[47,28,49,28],[47,29,47,33],[47,34,47,36],[47,37,47,38],[48,23,49,25],[48,26,49,27],[40,34,40,36],[40,37,40,38],[43,23,43,25],[43,26,43,27],[43,28,43,33],[43,34,43,36],[43,37,43,38],[44,23,44,25],[44,26,44,27],[44,28,44,33],[44,34,44,36],[44,37,44,38],[41,1,44,9],[41,23,41,25],[41,26,41,27],[41,28,41,33],[41,34,41,36],[38,28,38,29],[38,30,38,33],[38,34,38,36],[38,37,38,38],[39,0,40,9],[39,23,39,25],[39,26,39,27],[39,28,39,33],[39,34,39,36],[39,37,39,38],[41,37,41,38],[42,23,42,25],[42,26,42,27],[42,28,42,33],[42,34,42,36],[42,37,42,38],[40,23,40,25],[40,26,40,27],[40,28,40,33],[35,7,35,11],[35,12,35,38],[36,0,36,6],[36,7,36,11],[36,12,36,38],[38,11,38,15],[38,16,38,18],[38,19,38,20],[38,21,38,24],[38,25,38,27],[32,7,32,11],[32,12,32,38],[33,7,33,11],[33,12,33,38],[34,7,34,11],[34,12,34,38],[29,7,29,11],[29,12,29,38],[30,7,30,11],[30,12,30,38],[31,7,31,11],[31,12,31,38],[26,0,26,6],[26,7,26,11],[26,12,26,38],[27,7,27,11],[27,12,27,38],[28,7,28,11],[28,12,28,38],[24,29,24,33],[24,34,24,36],[24,37,24,38],[25,29,25,33],[25,34,25,36],[25,37,25,38],[21,0,21,29],[21,30,21,32],[21,33,21,38],[23,23,23,27],[23,28,25,28],[23,29,23,33],[23,34,23,36],[23,37,23,38],[24,23,25,25],[24,26,25,27],[19,30,19,33],[19,34,19,36],[19,37,19,38],[20,7,20,11],[20,12,20,14],[20,16,20,20],[20,21,20,23],[20,30,20,32],[20,33,20,38],[19,11,19,15],[19,16,19,18],[19,19,19,20],[19,21,19,24],[19,25,19,27],[19,28,19,29],[7,25,8,27],[7,28,7,32],[13,0,13,38],[15,23,15,25],[15,26,15,38],[16,23,16,25],[16,26,16,38],[17,0,17,38],[9,30,9,31],[9,32,9,34],[9,35,9,36],[9,37,9,38],[2,0,2,38],[4,0,4,38],[6,0,6,6],[6,7,6,13],[6,14,6,18],[6,19,6,38],[9,41,9,46],[10,0,11,7],[9,0,9,6],[9,7,9,16],[9,17,9,22],[9,23,9,24],[9,25,9,27],[9,28,9,29],[7,33,7,38],[8,3,8,6],[8,7,8,10],[8,11,8,24],[8,28,8,32],[8,33,8,38],[7,0,8,2],[7,3,7,6],[7,7,7,10],[7,11,7,24]]}
["（様式２）"]
[]
["新型コロナウイルス感染症緊急包括支援交付金（介護分）に関する事業実績報告書（事業所単位）",null,null,null,null,null,null,null,null,null,null,null,null,null,null,null,null,null,null,null,null,null,null,null,null,null,null,null,null,null,null,null,null,null,null,null,null,null,null,null,null,null,null,null,null,null,null,null,null,null,null,null,null,null,null,null,null,null,null,null,null,null,null,null,null,null,null,null,null,null,null,null,null,null,null,null,null,null,null,"（１）①　",null,null,"（２）②"]
[null,null,null,null,null,null,null,null,null,null,null,null,null,null,null,null,null,null,null,null,null,null,null,null,null,null,null,null,null,null,null,null,null,null,null,null,null,null,null,null,null,null,null,null,null,null,null,null,null,null,null,null,null,null,null,null,null,null,null,null,null,null,null,null,null,null,null,null,null,null,null,null,null,null,null,null,null,null,null,"共通",null,"単価","共通"]
["施設概要",null,null,null,null,null,null,null,null,null,null,null,null,null,null,null,null,null,null,null,null,null,null,null,null,null,null,null,null,null,null,null,null,null,null,null,null,null,null,null,null,null,null,null,null,null,null,null,null,null,null,null,null,null,null,null,null,null,null,null,null,null,null,null,null,null,null,null,null,null,null,null,null,null,null,null,null,null,"通所介護事業所（通常規模型）",892,"/事業所",null,200,"/事業所"]
[null,null,null,null,null,null,null,null,null,null,null,null,null,null,null,null,null,null,null,null,null,null,null,null,null,null,null,null,null,null,null,null,null,null,null,null,null,null,null,null,null,null,null,null,null,null,null,null,null,null,null,null,null,null,null,null,null,null,null,null,null,null,null,null,null,null,null,null,null,null,null,null,null,null,null,null,null,null,"通所介護事業所（大規模型（Ⅰ））",1137,"/事業所",null,200,"/事業所"]
["介護保険事業所番号",null,null,null,null,null,null,null,null,null,null,null,null,null,"事業所名称",null,null,null,null,null,null,null,null,null,null,null,null,null,null,null,null,null,null,null,null,null,null,null,null,null,null,null,null,null,null,null,null,null,null,null,null,null,null,null,null,null,null,null,null,null,null,null,null,null,null,null,null,null,null,null,null,null,null,null,null,null,null,null,"通所介護事業所（大規模型（Ⅱ））",1480,"/事業所",null,200,"/事業所"]
["所在地",null,null,"郵便番号",null,null,null,"都道府県名",null,null,null,"住所",null,null,null,null,null,null,null,null,null,null,null,null,null,"連絡先",null,null,"電話番号",null,null,null,null,"担当部署名",null,null,null,null,null,null,null,null,null,null,null,null,null,null,null,null,null,null,null,null,null,null,null,null,null,null,null,null,null,null,null,null,null,null,null,null,null,null,null,null,null,null,null,null,"地域密着型通所介護事業所(療養通所介護事業所を含む)",384,"/事業所",null,200,"/事業所"]
[null,null,null,null,null,null,null,"三重県",null,null,null,null,null,null,null,null,null,null,null,null,null,null,null,null,null,null,null,null,null,null,null,null,null,null,null,null,null,null,null,null,null,null,null,null,null,null,null,null,null,null,null,null,null,null,null,null,null,null,null,null,null,null,null,null,null,null,null,null,null,null,null,null,null,null,null,null,null,null,"認知症対応型通所介護事業所",375,"/事業所",null,200,"/事業所"]
["提供サービス",null,null,null,null,null,null,null,null,null,null,null,null,null,null,null,null,"サービス種類コード",null,null,null,null,null,null,null,"定員",null,null,null,null,"人",null,"職員数\n(派遣含む)",null,null,null,null,"人",null,null,null,null,null,null,null,null,null,null,null,null,null,null,null,null,null,null,null,null,null,null,null,null,null,null,null,null,null,null,null,null,null,null,null,null,null,null,null,null,"通所リハビリテーション事業所（通常規模型）",939,"/事業所",null,200,"/事業所"]
["事業区分",null,null,null,null,null,null,null,null," 介護慰労金事業　→　1を記載",null,null,null,null,null,null,null,null,null,null,null,null,null,null,null,"  感染対策費用助成事業　→ 2を記載",null,null,null,null,null,null,null,null,null,null,null,null,null,null,null,null,null,null,null,null,null,null,null,null,null,null,null,null,null,null,null,null,null,null,null,null,null,null,null,null,null,null,null,null,null,null,null,null,null,null,null,null,"通所リハビリテーション事業所（大規模型（Ⅰ））",1181,"/事業所",null,200,"/事業所"]
[null,null,null,null,null,null,null,null,null," 個別再開支援助成事業　→ 3を記載",null,null,null,null,null,null,null,null,null,null,null,null,null,null,null,"　再開環境整備助成事業　→ 4を記載",null,null,null,null,null,null,null,null,null,null,null,null,null,null,null,null,null,null,null,null,null,null,null,null,null,null,null,null,null,null,null,null,null,null,null,null,null,null,null,null,null,null,null,null,null,null,null,null,null,null,null,null,"通所リハビリテーション事業所（大規模型（Ⅱ））",1885,"/事業所",null,200,"/事業所"]
[null,null,null,null,null,null,null,null,null,null,null,null,null,null,null,null,null,null,null,null,null,null,null,null,null,null,null,null,null,null,null,null,null,null,null,null,null,null,null,null,null,null,null,null,null,null,null,null,null,null,null,null,null,null,null,null,null,null,null,null,null,null,null,null,null,null,null,null,null,null,null,null,null,null,null,null,null,null,"短期入所生活介護事業所",{"$f":"CD13*個票1!$AC$10","v":0},"/定員",44,200,"/事業所"]
[null,null,null,null,null,null,null,null,null,null,null,null,null,null,null,null,null,null,null,null,null,null,null,null,null,null,null,null,null,null,null,null,null,null,null,null,null,null,null,null,null,null,null,null,null,null,null,null,null,null,null,null,null,null,null,null,null,null,null,null,null,null,null,null,null,null,null,null,null,null,null,null,null,null,null,null,null,null,"短期入所療養介護事業所",{"$f":"CD14*個票1!$AC$10","v":0},"/定員",44,200,"/事業所"]
[null,null,null,null,null,null,null,null,null,null,null,null,null,null,null,null,null,null,null,null,null,null,null,null,null,null,null,null,null,null,null,null,null,null,null,null,null,null,null,null,null,null,null,null,null,null,null,null,null,null,null,null,null,null,null,null,null,null,null,null,null,null,null,null,null,null,null,null,null,null,null,null,null,null,null,null,null,null,"訪問介護事業所",534,"/事業所",null,200,"/事業所"]
[null,null,null,null,null,null,null,null,null,null,null,null,null,null,null,null,null,null,null,null,null,null,null,null,null,null,null,null,null,null,null,null,null,null,null,null,null,null,null,null,null,null,null,null,null,null,null,null,null,null,null,null,null,null,null,null,null,null,null,null,null,null,null,null,null,null,null,null,null,null,null,null,null,null,null,null,null,null,"訪問入浴介護事業所",564,"/事業所",null,200,"/事業所"]
[null,null,null,null,null,null,null,null,null,null,null,null,null,null,null,null,null,null,null,null,null,null,null,null,null,null,null,null,null,null,null,null,null,null,null,null,null,null,null,null,null,null,null,null,null,null,null,null,null,null,null,null,null,null,null,null,null,null,null,null,null,null,null,null,null,null,null,null,null,null,null,null,null,null,null,null,null,null,"訪問看護事業所",518,"/事業所",null,200,"/事業所"]
["支出済額",null,null,null,null,null,null,null,null,null,null,null,null,null,null,null,null,null,null,null,null,null,null,null,null,null,null,null,null,null,null,null,null,null,null,null,null,null,null,null,null,null,null,null,null,null,null,null,null,null,null,null,null,null,null,null,null,null,null,null,null,null,null,null,null,null,null,null,null,null,null,null,null,null,null,null,null,null,"訪問リハビリテーション事業所",227,"/事業所",null,200,"/事業所"]
["１．介護慰労金事業",null,null,null,null,null,null,null," ※対象職員の氏名等について、様式３を作成すること。",null,null,null,null,null,null,null,null,null,null,null,null,null,null,null,null,null,null,null,null,null,null,null,null,null,null,null,null,null,null,null,null,null,null,null,null,null,null,null,null,null,null,null,null,null,null,null,null,null,null,null,null,null,null,null,null,null,null,null,null,null,null,null,null,null,null,null,null,null,"定期巡回・随時対応型訪問介護看護事業所",508,"/事業所",null,200,"/事業所"]
[null,null,null,null,null,null,null,null,null,null,null,"実績報告額①",null,null,null,null,{"$f":"IF(Z20=\"\",\"0\",MIN(AE22,Z20))","v":"0"},null,null,"千円",null,"交付済額",null,null,null,null,null,null,"千円",null,"返還額",null,null,null,{"$f":"IF(Z20-Q20=0,\"0\",Z20-Q20)","v":"0"},null,null,"千円",null,null,null,null,null,null,null,null,null,null,null,null,null,null,null,null,null,null,null,null,null,null,null,null,null,null,null,null,null,null,null,null,null,null,null,null,null,null,null,null,"夜間対応型訪問介護事業所",204,"/事業所",null,200,"/事業所"]
{"$rows_left_out":43}
{"sheet":"職員表","index":4,"n_rows":86,"n_cols":22,"rows_kept":86,"cut":false,"hidden":false,"merged":[[3,19,3,21],[3,15,3,18],[3,0,4,0],[3,6,4,6],[3,7,3,9],[3,14,4,14],[3,1,4,1],[3,2,4,2],[3,3,4,3],[3,10,3,13]]}
["（様式３）介護慰労金受給職員表（法人単位）"]
[]
["※　本表は法人単位でまとめて記載すること。"]
[null,"氏名\n（漢字）","氏名\n（全角カナ）","生年月日\n（西暦）",null,null,"本人の住所","主たる勤務先",null,null,"分類",null,null,null,"慰労金\n(万円)","確認事項",null,null,null,"支払実績"]
[null,null,null,null,"（確認用）","（確認用）",null,"事業所番号","サービス種類コード","事業所・施設の名称","施設区分","対応区分","(計算用)","他の施設等との期間通算がある場合その施設名",null,"委任状の有無","他法人での慰労金の申請の有無","業務委託による\n従事者","重複\n申請者確認用","支払年月日\n(西暦)","支払金額\n（円）","支払わなかった場合の理由"]
[{"$f":"ROW()-5","v":1},null,null,null,{"$f":"B6&C6&D6","v":""},{"$f":"IF(E6=\"\",\"\",COUNTIF($E$6:$E$85,E6))","v":""},null,null,null,null,null,null,{"$f":"K6&L6","v":""},null,{"$f":"IFERROR(VLOOKUP(M6,計算用!$A$8:$B$15,2,FALSE),\"\")","v":""},null,null,null,{"$f":"IF(F6>=2,\"\",\"可\")","v":""}]
[{"$f":"ROW()-5","v":2},null,null,null,{"$f":"B7&C7&D7","v":""},{"$f":"IF(E7=\"\",\"\",COUNTIF($E$6:$E$85,E7))","v":""},null,null,null,null,null,null,{"$f":"K7&L7","v":""},null,{"$f":"IFERROR(VLOOKUP(M7,計算用!$A$8:$B$15,2,FALSE),\"\")","v":""},null,null,null,{"$f":"IF(F7>=2,\"\",\"可\")","v":""}]
[3,null,null,null,{"$f":"B8&C8&D8","v":""},{"$f":"IF(E8=\"\",\"\",COUNTIF($E$6:$E$85,E8))","v":""},null,null,null,null,null,null,"",null,{"$f":"IFERROR(VLOOKUP(M8,計算用!$A$8:$B$15,2,FALSE),\"\")","v":""},null,null,null,""]
[4,null,null,null,"",{"$f":"IF(E9=\"\",\"\",COUNTIF($E$6:$E$85,E9))","v":""},null,null,null,null,null,null,"",null,{"$f":"IFERROR(VLOOKUP(M9,計算用!$A$8:$B$15,2,FALSE),\"\")","v":""},null,null,null,""]
[5,null,null,null,"","",null,null,null,null,null,null,"",null,{"$f":"IFERROR(VLOOKUP(M10,計算用!$A$8:$B$15,2,FALSE),\"\")","v":""},null,null,null,""]
[6,null,null,null,"","",null,null,null,null,null,null,"",null,{"$f":"IFERROR(VLOOKUP(M11,計算用!$A$8:$B$15,2,FALSE),\"\")","v":""},null,null,null,""]
[7,null,null,null,"","",null,null,null,null,null,null,"",null,{"$f":"IFERROR(VLOOKUP(M12,計算用!$A$8:$B$15,2,FALSE),\"\")","v":""},null,null,null,""]
[8,null,null,null,"","",null,null,null,null,null,null,"",null,{"$f":"IFERROR(VLOOKUP(M13,計算用!$A$8:$B$15,2,FALSE),\"\")","v":""},null,null,null,""]
[9,null,null,null,"","",null,null,null,null,null,null,{"$f":"K14&L14","v":""},null,{"$f":"IFERROR(VLOOKUP(M14,計算用!$A$8:$B$15,2,FALSE),\"\")","v":""},null,null,null,""]
[10,null,null,null,"","",null,null,null,null,null,null,"",null,{"$f":"IFERROR(VLOOKUP(M15,計算用!$A$8:$B$15,2,FALSE),\"\")","v":""},null,null,null,""]
[11,null,null,null,"","",null,null,null,null,null,null,"",null,{"$f":"IFERROR(VLOOKUP(M16,計算用!$A$8:$B$15,2,FALSE),\"\")","v":""},null,null,null,""]
[12,null,null,null,"","",null,null,null,null,null,null,"",null,{"$f":"IFERROR(VLOOKUP(M17,計算用!$A$8:$B$15,2,FALSE),\"\")","v":""},null,null,null,""]
[13,null,null,null,"","",null,null,null,null,null,null,"",null,{"$f":"IFERROR(VLOOKUP(M18,計算用!$A$8:$B$15,2,FALSE),\"\")","v":""},null,null,null,""]
[14,null,null,null,"","",null,null,null,null,null,null,"",null,{"$f":"IFERROR(VLOOKUP(M19,計算用!$A$8:$B$15,2,FALSE),\"\")","v":""},null,null,null,""]
[15,null,null,null,"","",null,null,null,null,null,null,"",null,{"$f":"IFERROR(VLOOKUP(M20,計算用!$A$8:$B$15,2,FALSE),\"\")","v":""},null,null,null,""]
{"$rows_left_out":67}
{"sheet":"役員等調書","index":5,"n_rows":46,"n_cols":10,"rows_kept":46,"cut":false,"hidden":false,"merged":[[8,0,9,0],[8,1,9,2],[8,3,8,6],[8,7,9,7],[8,9,9,9],[1,0,1,9],[3,1,3,7],[5,1,5,3],[5,4,5,6],[6,1,6,6],[21,1,21,2],[10,1,10,2],[11,1,11,2],[12,1,12,2],[13,1,13,2],[14,1,14,2],[15,1,15,2],[16,1,16,2],[17,1,17,2],[18,1,18,2],[19,1,19,2],[20,1,20,2],[33,1,33,2],[22,1,22,2],[23,1,23,2],[24,1,24,2],[25,1,25,2],[26,1,26,2],[27,1,27,2],[28,1,28,2],[29,1,29,2],[30,1,30,2],[31,1,31,2],[32,1,32,2],[45,1,45,2],[34,1,34,2],[35,1,35,2],[36,1,36,2],[37,1,37,2],[38,1,38,2],[39,1,39,2],[40,1,40,2],[41,1,41,2],[42,1,42,2],[43,1,43,2],[44,1,44,2]]}
["別紙"]
["役　員　等　調　書"]
[]
["法人名"]
["交付決定年月日","令和",null,"年",null,"月",null,"日"]
["交付決定番号","三重県指令医保第１３－　　　　号",null,null,null,null,null,"号"]
["交付決定額（計）",null,null,null,null,null,null,"円"]
["役員等の状況"]
["ｼﾒｲ","氏名",null,"生年月日",null,null,null,"性別","備考","法人名"]
[null,null,null,"元号","年","月","日",null,"（氏名の異体字など）"]
["(例) ﾊﾂﾄﾘ ｼﾕｳｿﾞｳ","服部　修造",null,"S",40,1,1,"M"]
[null,null,null,null,null,null,null,null,null,{"$f":"IF($A12=\"\",\"\",$B$4)","v":""}]
[null,null,null,null,null,null,null,null,null,""]
[null,null,null,null,null,null,null,null,null,""]
[null,null,null,null,null,null,null,null,null,""]
[null,null,null,null,null,null,null,null,null,""]
[null,null,null,null,null,null,null,null,null,""]
[null,null,null,null,null,null,null,null,null,""]
[null,null,null,null,null,null,null,null,null,""]
[null,null,null,null,null,null,null,null,null,""]
{"$rows_left_out":27}
{"sheet":"計算用","index":6,"n_rows":67,"n_cols":8,"rows_kept":67,"cut":false,"hidden":true,"merged":[]}
[null,null,null,null,null,null,null,"※本シートは絶対に編集しないこと。"]
["施設区分"]
["陽性者(濃厚接触者)発生施設","通所系･施設系で1日以上勤務又は訪問系で陽性者等に1日以上対応","訪問系で陽性者等への対応はないが対象期間に10日以上勤務","対象期間の勤務が９日以下"]
["その他の施設","対象期間に10日以上勤務","対象期間の勤務が9日以下"]
[]
[]
["慰労金単価"]
[{"$f":"A3&B3","v":"陽性者(濃厚接触者)発生施設通所系･施設系で1日以上勤務又は訪問系で陽性者等に1日以上対応"},20]
[{"$f":"A3&C3","v":"陽性者(濃厚接触者)発生施設訪問系で陽性者等への対応はないが対象期間に10日以上勤務"},5]
[{"$f":"A3&D3","v":"陽性者(濃厚接触者)発生施設対象期間の勤務が９日以下"},0]
[{"$f":"A4&B4","v":"その他の施設対象期間に10日以上勤務"},5]
[{"$f":"A4&C4","v":"その他の施設対象期間の勤務が9日以下"},0]
[]
[]
[]
[]
["なし"]
["あり"]
[]
[]
{"$rows_left_out":47}